{"text_format":"1","workbook":"xlsx","n_sheets":9,"sheets":["Directions","Coral Assessment ","Sheet2","Sheet3","Justifications","Definitions","CompFcnServ","Risk Assessment","RA Numbers"],"not_rendered":{"charts":6,"images":3,"macros":0,"external_links":1,"defined_names":11,"comments":0,"pivot_tables":0},"unopened":[],"bounds":{"document_bytes":16777216,"sheet_cells":100000,"rows_first":2000,"rows_last":500,"rows_between":2000,"halvings":0,"cell_chars":16384,"cell_head_chars":4096},"cells_cut":0,"cells_raw":0,"read":"whole","date_system":"1900"}

{"sheet":"Directions","index":0,"n_rows":36,"n_cols":4,"rows_kept":36,"cut":false,"hidden":false,"merged":[[32,3,32,10],[35,1,35,8],[20,3,26,10],[1,3,2,9],[7,3,10,10],[12,3,14,10],[15,3,18,10]]}
[]
[null,null,null,"Directions for using the US Army of Corps of Engineers Coral Ecological Services and Functions Assessment Tool"]
[]
[]
[]
[null,null,1,"Go to the  Coral Assessment  sheet."]
[]
[null,null,2,"Under Step 1, fill in all of the light yellow sections by typing within the light yellow portions. Note that Project Type is a pull-down menu where you select your answer. Also note that as you type in certain sections, white portions above will fill in automatically with a title for this project."]
[]
[]
{"$rows_left_out":27}
{"sheet":"Coral Assessment ","index":1,"n_rows":199,"n_cols":27,"rows_kept":199,"cut":false,"hidden":false,"merged":[[137,20,139,21],[0,0,0,6],[198,1,198,3],[11,4,11,11],[13,14,13,20],[184,20,186,21],[169,20,171,21],[153,20,155,21],[190,1,190,3],[185,1,186,2],[185,3,186,4],[182,1,182,2],[182,3,182,4],[188,1,188,3],[93,2,93,3],[93,7,93,8],[16,11,16,13],[5,2,5,3],[4,5,4,7],[17,24,19,24],[17,25,19,25],[17,26,19,26],[16,24,16,26],[1,1,1,4],[1,6,1,13],[6,2,6,3],[2,1,2,3],[2,5,2,10],[10,15,10,16],[9,15,9,16],[135,9,135,10],[133,9,134,10],[3,4,3,6],[9,6,9,8],[5,5,5,6],[93,9,93,10]]}
["US Army Corps of Engineers Coral Ecological Value Assessment Tool"]
[null,{"$f":"C6","v":0},null,null,null,"-",{"$f":"IF(D5<>\" \",_xlnm.Extract,\" \")","v":0}]
[null,{"$f":"IF(C12<>0,\"Man-Made Substrate\",IF(C13<>0,\"Altered Substrate\",IF(C14<>0,\"Natural Substrate\",\" \")))","v":" "},null,null,"-",{"$f":"IF(C12<>0,C12,IF(C13<>0,C13,IF(C14<>0,C14,\" \")))","v":" "}]
["Step 1","Directions: Fill in light yellow sections ONLY (and as applicable). Save as unique file to maintain master copy as template.",null,null,"Amount of bottom area damaged (or to be damaged), measured in acres",null,null,null,"acres","=",{"$f":"H4/0.000247","v":0},"m2"]
[null,"General Information","Project Type:",null,"Location:"]
[null,"Project Name:",null,null,"Depths:"]
[null,"Person Running the Assessment:",null,null,"Date Surveyed:",null,"to"]
[null,null,null,null,null,null,null,null,null,null,null,null,null,null,"Common","Uncommon","Rare",null,"Endemic",null,"Subhabitat","Natural","Altered","Man-Made"]
[null,null,null,null,null,null,null,null,null,null,null,null,null,null,1,2,3,null,2,null,null,{"$f":"IF(C14=\"\",0,IF(C14=\"Unconsolidated Substrate\",0.5,IF(C14=\"Boudler\",2,IF(C14=\"Solitary Colony\",1,IF(C14=\"Aggregated Colonies\",2,IF(C14=\"Reef Flat\",4,5))))))","v":0},{"$f":"IF(C13=\"\",0,IF(C13=\"Ship Channel Bottom\",0.5,IF(C13=\"Ship Channel Walls\",1,IF(C13=\"Grounding Scar or Anchorage\",1,IF(C13=\"Natural Modified Harbor Walls\",2,IF(C13=\"Longterm Outfall or Dump Site\",0.5,0.5))))))","v":0},{"$f":"IF(C12=\"\",0,IF(C12=\"Artificial Reef\",1,IF(C12=\"Pile or Column\",0.5,IF(C12=\"Breakwater\",2,IF(C12=\"Other\",0.5,IF(C12=\"Submerged Debris\",0.5,1))))))","v":0}]
[null,null,null,null,null,null,"Coral Colony Characterization  Formula Information",null,null,null,null,null,null,null,"Habitat","Subhabitat Type Selected",null,null,"Non-Endemic"]
{"$rows_left_out":190}
{"sheet":"Sheet2","index":2,"n_rows":44,"n_cols":7,"rows_kept":44,"cut":false,"hidden":true,"merged":[]}
[]
[]
["Man-Made Structure",null,null,null,null,"Natural","Unconsolidated Substrate"]
["Previously Altered or Degraded"]
["Natural Habitat - Consolidated Colonies",null,null,null,null,"Altered","Ship Channel Walls"]
[]
[null,null,null,null,null,"ManMade"]
["Unconsolidated Substrate"]
["Boulder"]
["Solitary Colony"]
{"$rows_left_out":35}
{"sheet":"Sheet3","index":3,"n_rows":56,"n_cols":19,"rows_kept":56,"cut":false,"hidden":true,"merged":[[2,12,2,16]]}
[null,"0 - 5 cm",">5 - 10 cm",">10 - 20 cm",">20 - 40 cm",">40 - 80 cm",">80 - 160 cm",">160 cm "]
["BRANCHING",{"$f":"'Coral Assessment '!C96","v":0},{"$f":"'Coral Assessment '!C97","v":0},{"$f":"'Coral Assessment '!C98","v":0},{"$f":"'Coral Assessment '!C99","v":0},{"$f":"'Coral Assessment '!C100","v":0},{"$f":"'Coral Assessment '!C101","v":0}]
["ENCRUSTING",{"$f":"'Coral Assessment '!C104","v":0},{"$f":"'Coral Assessment '!C105","v":0},{"$f":"'Coral Assessment '!C106","v":0},{"$f":"'Coral Assessment '!C107","v":0},{"$f":"'Coral Assessment '!C108","v":0},{"$f":"'Coral Assessment '!C109","v":0},{"$f":"'Coral Assessment '!C110","v":0},null,null,null,null,"Coral Assessment B"]
["MASSIVE",{"$f":"'Coral Assessment '!C112","v":0},{"$f":"'Coral Assessment '!C113","v":0},{"$f":"'Coral Assessment '!C114","v":0},{"$f":"'Coral Assessment '!C115","v":0},{"$f":"'Coral Assessment '!C116","v":0},{"$f":"'Coral Assessment '!C117","v":0},{"$f":"'Coral Assessment '!C118","v":0},null,null,null,null,"0 - 5 cm",">5 - 10 cm",">10 - 20 cm",">20 - 40 cm",">40 - 80 cm",">80 - 160 cm",">160 cm "]
["PLATE-LIKE",{"$f":"'Coral Assessment '!C120","v":0},{"$f":"'Coral Assessment '!C121","v":0},{"$f":"'Coral Assessment '!C122","v":0},{"$f":"'Coral Assessment '!C123","v":0},{"$f":"'Coral Assessment '!C124","v":0},{"$f":"'Coral Assessment '!C125","v":0},{"$f":"'Coral Assessment '!C126","v":0},null,null,null,"BRANCHING",{"$f":"#REF!","v":{"$error":"#REF!"}},{"$f":"#REF!","v":{"$error":"#REF!"}},{"$f":"#REF!","v":{"$error":"#REF!"}},{"$f":"#REF!","v":{"$error":"#REF!"}},{"$f":"#REF!","v":{"$error":"#REF!"}},{"$f":"#REF!","v":{"$error":"#REF!"}}]
["FREE-LIVING",{"$f":"'Coral Assessment '!C128","v":0},{"$f":"'Coral Assessment '!C129","v":0},{"$f":"'Coral Assessment '!C130","v":0},{"$f":"'Coral Assessment '!C131","v":0},{"$f":"'Coral Assessment '!C132","v":0},null,null,null,null,null,"ENCRUSTING",{"$f":"#REF!","v":{"$error":"#REF!"}},{"$f":"#REF!","v":{"$error":"#REF!"}},{"$f":"#REF!","v":{"$error":"#REF!"}},{"$f":"#REF!","v":{"$error":"#REF!"}},{"$f":"#REF!","v":{"$error":"#REF!"}},{"$f":"#REF!","v":{"$error":"#REF!"}},{"$f":"#REF!","v":{"$error":"#REF!"}}]
["DIGIFORM",{"$f":"'Coral Assessment '!C136","v":0},{"$f":"'Coral Assessment '!C137","v":0},{"$f":"'Coral Assessment '!C138","v":0},{"$f":"'Coral Assessment '!C139","v":0},{"$f":"'Coral Assessment '!C140","v":0},{"$f":"'Coral Assessment '!C141","v":0},{"$f":"'Coral Assessment '!C142","v":0},null,null,null,"MASSIVE",{"$f":"#REF!","v":{"$error":"#REF!"}},{"$f":"#REF!","v":{"$error":"#REF!"}},{"$f":"#REF!","v":{"$error":"#REF!"}},{"$f":"#REF!","v":{"$error":"#REF!"}},{"$f":"#REF!","v":{"$error":"#REF!"}},{"$f":"#REF!","v":{"$error":"#REF!"}},{"$f":"#REF!","v":{"$error":"#REF!"}}]
["TABLE",{"$f":"'Coral Assessment '!C144","v":0},{"$f":"'Coral Assessment '!C145","v":0},{"$f":"'Coral Assessment '!C146","v":0},{"$f":"'Coral Assessment '!C147","v":0},{"$f":"'Coral Assessment '!C148","v":0},{"$f":"'Coral Assessment '!C149","v":0},{"$f":"'Coral Assessment '!C150","v":0},null,null,"Char","PLATE-LIKE",{"$f":"#REF!","v":{"$error":"#REF!"}},{"$f":"#REF!","v":{"$error":"#REF!"}},{"$f":"#REF!","v":{"$error":"#REF!"}},{"$f":"#REF!","v":{"$error":"#REF!"}},{"$f":"#REF!","v":{"$error":"#REF!"}},{"$f":"#REF!","v":{"$error":"#REF!"}},{"$f":"#REF!","v":{"$error":"#REF!"}}]
["SOLITARY",{"$f":"'Coral Assessment '!C152","v":0},{"$f":"'Coral Assessment '!C153","v":0},{"$f":"'Coral Assessment '!C154","v":0},{"$f":"'Coral Assessment '!C155","v":0},{"$f":"'Coral Assessment '!C156","v":0},{"$f":"'Coral Assessment '!C157","v":0},{"$f":"'Coral Assessment '!C158","v":0},null,null,null,"FREE-LIVING",{"$f":"#REF!","v":{"$error":"#REF!"}},{"$f":"#REF!","v":{"$error":"#REF!"}},{"$f":"#REF!","v":{"$error":"#REF!"}},{"$f":"#REF!","v":{"$error":"#REF!"}},{"$f":"#REF!","v":{"$error":"#REF!"}}]
["FOLIACEOUS",{"$f":"'Coral Assessment '!C160","v":0},{"$f":"'Coral Assessment '!C161","v":0},{"$f":"'Coral Assessment '!C162","v":0},{"$f":"'Coral Assessment '!C163","v":0},{"$f":"'Coral Assessment '!C164","v":0},null,null,null,null,null,"DIGIFORM",{"$f":"#REF!","v":{"$error":"#REF!"}},{"$f":"#REF!","v":{"$error":"#REF!"}},{"$f":"#REF!","v":{"$error":"#REF!"}},{"$f":"#REF!","v":{"$error":"#REF!"}},{"$f":"#REF!","v":{"$error":"#REF!"}},{"$f":"#REF!","v":{"$error":"#REF!"}},{"$f":"#REF!","v":{"$error":"#REF!"}}]
{"$rows_left_out":47}
{"sheet":"Justifications","index":4,"n_rows":122,"n_cols":28,"rows_kept":122,"cut":false,"hidden":false,"merged":[[92,1,92,2],[4,14,4,15],[5,14,5,15],[6,14,6,15],[7,14,7,15],[8,14,8,15],[9,14,9,15],[4,1,4,2],[5,10,5,13],[12,14,12,15],[13,14,13,15],[64,1,64,2],[64,6,64,8],[10,14,10,15],[35,1,35,2],[35,12,35,13],[11,14,11,15],[18,14,18,15],[19,14,19,15],[14,14,14,15],[15,14,15,15],[20,14,20,15],[21,14,21,15],[22,14,22,15],[23,14,23,15],[16,14,16,15],[17,14,17,15],[91,10,91,15],[4,16,4,22],[5,16,5,22],[6,16,6,22],[7,16,7,22],[8,16,8,22],[9,16,9,22],[10,16,10,22],[11,16,11,22],[12,16,12,22],[18,16,18,22],[13,16,13,22],[14,16,14,22],[15,16,15,22],[16,16,16,22],[17,16,17,22],[121,2,121,6],[21,16,21,22],[22,16,22,22],[23,16,23,22],[19,16,19,22],[20,16,20,22],[118,7,118,12],[87,8,87,12],[62,8,62,12],[24,16,24,22],[25,16,25,22],[91,16,91,27],[67,9,75,11],[65,9,65,10],[90,8,90,11],[91,3,91,9]]}
[]
[]
[]
[]
[null,"Size Services & Functions"]
[null,null,null,"0 - 5 cm",">5 - 10 cm",">10 - 20 cm",">20 - 40 cm",">40 cm - 80 cm",">80 - 160 cm",">160 cm","Assumes same species and form for each size."]
[null,"Regulatory Function","Sand Formation",0,0,1,2,8,32,160]
[null,null,"Gas Production",0,1,2,4,12,48,192]
[null,null,"Climate Regulation",0,0,1,3,12,48,192]
[null,null,"Wave Energy Regulation",0,0,1,3,12,48,192]
{"$rows_left_out":113}
{"sheet":"Definitions","index":5,"n_rows":42,"n_cols":3,"rows_kept":42,"cut":false,"hidden":false,"merged":[[41,1,41,2]]}
[]
[null,"Aggregated Colonies","A mixture of coral colonies in a dense cluster but NOT constitutuing a reef structure (I.e. having a identified reef flat, reef crest and reef slope)"]
[null,"Anchorage","A site for anchoring vessels or where anchoring has occurred."]
[null,"Artificial Reef","An artificial reef is a human-made underwater structure, typically built for the purpose of promoting marine life in areas of generally featureless bottom."]
[null,"Boulder","A boulder is a volcanic rock with grain size of no less than 256 mm (10 inches) diameter."]
[null,"Breakwater","Breakwaters are structures constructed on coasts as part of coastal defence or to protect an anchorage from the effects of weather, onshore waves, and longshore drift."]
[null,"Compensatory Mitigation","The restoration (re-establishment or rehabilitation), establishment (creation), enhancement, and/or in certain circumstances preservation of aquatic resources for the purposes of offsetting unavoidable, adverse impacts, which remain after all appropriate and practicable avoidance and minimization has been achieved."]
[null,"Coral Reef","A geographic structure consisting of a reef crest, a reef slope, and a reef flat."]
[null,"Damaged Area","The defined and measured area exposed to direct (Primary) and indirect (Secondary) impact from a planned or unplanned event."]
[null,"Deep Reef","A coral reef habitat below the depth of normal wave activity (I.e. deeper than 60 feet (~20 m))."]
{"$rows_left_out":33}
{"sheet":"CompFcnServ","index":6,"n_rows":65,"n_cols":27,"rows_kept":65,"cut":false,"hidden":false,"merged":[[7,1,7,7],[7,10,7,18],[7,21,7,23],[3,2,3,17],[64,1,64,7]]}
[]
[]
[]
[null,null,"Comparison of Ecological Functions and Services by Colony  Size, Colony Form, and Species Rarity"]
[]
[]
[]
[null,"Colony Size",null,null,null,null,null,null,null,null,"Colony Form",null,null,null,null,null,null,null,null,null,null,"Rarity",null,null,null,"Endemism"]
[null,"0 - 5 cm","5 - 10 cm","10 - 20 cm","20 - 40 cm","40 - 80 cm","80 - 160 cm","160+ cm",null,null,"Encrusting","Massive","Branching","Digiform","Foliaceous","Free-Living","Solitary","Plate","Table",null,null,"Common","Uncommon","Rare",null,"no","yes"]
["Regulatory Function",{"$f":"('Coral Assessment '!C92*SUM(Justifications!D7:D11))","v":0},{"$f":"('Coral Assessment '!D92*SUM(Justifications!E7:E11))","v":0},{"$f":"('Coral Assessment '!E92*SUM(Justifications!F7:F11))","v":0},{"$f":"('Coral Assessment '!F92*SUM(Justifications!G7:G11))","v":0},{"$f":"('Coral Assessment '!G92*SUM(Justifications!H7:H11))","v":0},{"$f":"('Coral Assessment '!H92*SUM(Justifications!I7:I11))","v":0},{"$f":"('Coral Assessment '!I92*SUM(Justifications!J7:J11))","v":0},null,"Regulatory Function",{"$f":"('Coral Assessment '!F110*SUM(Justifications!D37:D41))","v":0},{"$f":"('Coral Assessment '!F118*SUM(Justifications!E37:E41))","v":0},{"$f":"('Coral Assessment '!F102*SUM(Justifications!F37:F41))","v":0},{"$f":"('Coral Assessment '!F142*SUM(Justifications!G37:G41))","v":0},{"$f":"('Coral Assessment '!F164*SUM(Justifications!H37:H41))","v":0},{"$f":"('Coral Assessment '!F134*SUM(Justifications!I37:I41))","v":0},{"$f":"('Coral Assessment '!F158*SUM(Justifications!J37:J41))","v":0},{"$f":"('Coral Assessment '!F126*SUM(Justifications!K37:K41))","v":0},{"$f":"('Coral Assessment '!F150*SUM(Justifications!L37:L41))","v":0},null,"Regulatory Function",{"$f":"SUM('Coral Assessment '!C25+'Coral Assessment '!D25+'Coral Assessment '!E25+'Coral Assessment '!F25+'Coral Assessment '!G25+'Coral Assessment '!H25+'Coral Assessment '!C28+'Coral Assessment '!D28+'Coral Assessment '!E28+'Coral Assessment '!F28+'Coral Assessment '!G28+'Coral Assessment '!H28+'Coral Assessment '!I28+'Coral Assessment '!C30+'Coral Assessment '!D30+'Coral Assessment '!E30+'Coral Assessment '!F30+'Coral Assessment '!G30+'Coral Assessment '!H30+'Coral Assessment '!I30+'Coral Assessment '!C32+'Coral Assessment '!D32+'Coral Assessment '!E32+'Coral Assessment '!F32+'Coral Assessment '!G32+'Coral Assessment '!H32+'Coral Assessment '!I32+'Coral Assessment '!C40+'Coral Assessment '!D40+'Coral Assessment '!E40+'Coral Assessment '!F40+'Coral Assessment '!G40+'Coral Assessment '!H40+'Coral Assessment '!I40+'Coral Assessment '!C43+'Coral Assessment '!D43+'Coral Assessment '!E43+'Coral Assessment '!F43+'Coral Assessment '!G43+'Coral Assessment '!H43+'Coral Assessment '!I43+'Coral Assessment '!C61+'Coral Assessment '!D61+'Coral Assessment '!E61+'Coral Assessment '!F61+'Coral Assessment '!G61+'Coral Assessment '!H61+'Coral Assessment '!I61+'Coral Assessment '!C65+'Coral Assessment '!D65+'Coral Assessment '!E65+'Coral Assessment '!F65+'Coral Assessment '!G65+'Coral Assessment '!H65+'Coral Assessment '!I65+'Coral Assessment '!C69+'Coral Assessment '!D69+'Coral Assessment '!E69+'Coral Assessment '!F69+'Coral Assessment '!G69+'Coral Assessment '!C76+'Coral Assessment '!D76+'Coral Assessment '!E76+'Coral Assessment '!F76+'Coral Assessment '!G76+'Coral Assessment '!C83+'Coral Assessment '!D83+'Coral Assessment '!E83+'Coral Assessment '!C85+'Coral Assessment '!D85+'Coral Assessment '!E85+'Coral Assessment '!F85+'Coral Assessment '!G85+'Coral Assessment '!H85+'Coral Assessment '!I85)*SUM(Justifications!D66:D70)","v":0},{"$f":"SUM('Coral Assessment '!C22+'Coral Assessment '!D22+'Coral Assessment '!E22+'Coral Assessment '!F22+'Coral Assessment '!G22+'Coral Assessment '!H22+'Coral Assessment '!C23+'Coral Assessment '!D23+'Coral Assessment '!E23+'Coral Assessment '!F23+'Coral Assessment '!G23+'Coral Assessment '!H23+'Coral Assessment '!C31+'Coral Assessment '!D31+'Coral Assessment '!E31+'Coral Assessment '!F31+'Coral Assessment '!G31+'Coral Assessment '!H31+'Coral Assessment '!I31+'Coral Assessment '!C38+'Coral Assessment '!D38+'Coral Assessment '!E38+'Coral Assessment '!C39+'Coral Assessment '!D39+'Coral Assessment '!E39+'Coral Assessment '!F39+'Coral Assessment '!G39+'Coral Assessment '!C44+'Coral Assessment '!D44+'Coral Assessment '!E44+'Coral Assessment '!F44+'Coral Assessment '!G44+'Coral Assessment '!H44+'Coral Assessment '!I44+'Coral Assessment '!C45+'Coral Assessment '!D45+'Coral Assessment '!E45+'Coral Assessment '!F45+'Coral Assessment '!G45+'Coral Assessment '!H45+'Coral Assessment '!I45+'Coral Assessment '!C47+'Coral Assessment '!D47+'Coral Assessment '!E47+'Coral Assessment '!F47+'Coral Assessment '!G48+'Coral Assessment '!G47+'Coral Assessment '!H47+'Coral Assessment '!I47+'Coral Assessment '!I48+'Coral Assessment '!H48+'Coral Assessment '!F48+'Coral Assessment '!E48+'Coral Assessment '!D48+'Coral Assessment '!C48+'Coral Assessment '!C49+'Coral Assessment '!D49+'Coral Assessment '!E49+'Coral Assessment '!F49+'Coral Assessment '!G49+'Coral Assessment '!C53+'Coral Assessment '!D53+'Coral Assessment '!E53+'Coral Assessment '!F53+'Coral Assessment '!G53+'Coral Assessment '!H53+'Coral Assessment '!I53+'Coral Assessment '!C54+'Coral Assessment '!D54+'Coral Assessment '!E54+'Coral Assessment '!C59+'Coral Assessment '!D59+'Coral Assessment '!E59+'Coral Assessment '!F59+'Coral Assessment '!G59+'Coral Assessment '!H59+'Coral Assessment '!I59+'Coral Assessment '!C72+'Coral Assessment '!D72+'Coral Assessment '!E72+'Coral Assessment '!C75+'Coral Assessment '!D75+'Coral Assessment '!E75+'Coral Assessment '!F75+'Coral Assessment '!G75+'Coral Assessment '!C78+'Coral Assessment '!D78+'Coral Assessment '!E78+'Coral Assessment '!F78+'Coral Assessment '!G78+'Coral Assessment '!H78+'Coral Assessment '!I78+'Coral Assessment '!C80+'Coral Assessment '!D80+'Coral Assessment '!E80+'Coral Assessment '!F80+'Coral Assessment '!G80+'Coral Assessment '!C82+'Coral Assessment '!D82+'Coral Assessment '!E82+'Coral Assessment '!C87+'Coral Assessment '!D87+'Coral Assessment '!E87+'Coral Assessment '!F87+'Coral Assessment '!G87+'Coral Assessment '!H87+'Coral Assessment '!I87+'Coral Assessment '!C89+'Coral Assessment '!D89+'Coral Assessment '!E89+'Coral Assessment '!F89+'Coral Assessment '!G89+'Coral Assessment '!H89+'Coral Assessment '!I89)*SUM(Justifications!E66:E70)","v":0},{"$f":"SUM('Coral Assessment '!C20+'Coral Assessment '!D20+'Coral Assessment '!E20+'Coral Assessment '!C24+'Coral Assessment '!D24+'Coral Assessment '!E24+'Coral Assessment '!F24+'Coral Assessment '!G24+'Coral Assessment '!H24+'Coral Assessment '!C26+'Coral Assessment '!D26+'Coral Assessment '!E26+'Coral Assessment '!F26+'Coral Assessment '!G26+'Coral Assessment '!H26+'Coral Assessment '!C29+'Coral Assessment '!D29+'Coral Assessment '!E29+'Coral Assessment '!F29+'Coral Assessment '!G29+'Coral Assessment '!H29+'Coral Assessment '!I29+'Coral Assessment '!C33+'Coral Assessment '!D33+'Coral Assessment '!E33+'Coral Assessment '!F33+'Coral Assessment '!G33+'Coral Assessment '!H33+'Coral Assessment '!I33+'Coral Assessment '!C35+'Coral Assessment '!D35+'Coral Assessment '!E35+'Coral Assessment '!F35+'Coral Assessment '!G35+'Coral Assessment '!H35+'Coral Assessment '!I35+'Coral Assessment '!C37+'Coral Assessment '!D37+'Coral Assessment '!E37+'Coral Assessment '!F37+'Coral Assessment '!G37+'Coral Assessment '!H37+'Coral Assessment '!I37+'Coral Assessment '!C41+'Coral Assessment '!D41+'Coral Assessment '!E41+'Coral Assessment '!F41+'Coral Assessment '!G41+'Coral Assessment '!H41+'Coral Assessment '!I41+'Coral Assessment '!C42+'Coral Assessment '!D42+'Coral Assessment '!E42+'Coral Assessment '!F42+'Coral Assessment '!G42+'Coral Assessment '!H42+'Coral Assessment '!I42+'Coral Assessment '!C46+'Coral Assessment '!D46+'Coral Assessment '!E46+'Coral Assessment '!F46+'Coral Assessment '!G46+'Coral Assessment '!H46+'Coral Assessment '!I46+'Coral Assessment '!C51+'Coral Assessment '!D51+'Coral Assessment '!E51+'Coral Assessment '!F51+'Coral Assessment '!G51+'Coral Assessment '!H51+'Coral Assessment '!I51+'Coral Assessment '!C52+'Coral Assessment '!D52+'Coral Assessment '!E52+'Coral Assessment '!F52+'Coral Assessment '!G52+'Coral Assessment '!H52+'Coral Assessment '!I52+'Coral Assessment '!C55+'Coral Assessment '!D55+'Coral Assessment '!E55+'Coral Assessment '!F55+'Coral Assessment '!G55+'Coral Assessment '!H55+'Coral Assessment '!I55+'Coral Assessment '!C56+'Coral Assessment '!D56+'Coral Assessment '!E56+'Coral Assessment '!F56+'Coral Assessment '!G56+'Coral Assessment '!H56+'Coral Assessment '!I56+'Coral Assessment '!C57+'Coral Assessment '!D57+'Coral Assessment '!E57+'Coral Assessment '!F57+'Coral Assessment '!G57+'Coral Assessment '!C60+'Coral Assessment '!D60+'Coral Assessment '!E60+'Coral Assessment '!F60+'Coral Assessment '!G60+'Coral Assessment '!H60+'Coral Assessment '!I60+'Coral Assessment '!C63+'Coral Assessment '!D63+'Coral Assessment '!E63+'Coral Assessment '!F63+'Coral Assessment '!G63+'Coral Assessment '!C64+'Coral Assessment '!D64+'Coral Assessment '!E64+'Coral Assessment '!F64+'Coral Assessment '!G64+'Coral Assessment '!H64+'Coral Assessment '!I64+'Coral Assessment '!C66+'Coral Assessment '!D66+'Coral Assessment '!E66+'Coral Assessment '!F66+'Coral Assessment '!G66+'Coral Assessment '!H66+'Coral Assessment '!I66+'Coral Assessment '!C67+'Coral Assessment '!D67+'Coral Assessment '!E67+'Coral Assessment '!F67+'Coral Assessment '!I88+'Coral Assessment '!H88+'Coral Assessment '!G88+'Coral Assessment '!F88+'Coral Assessment '!E88+'Coral Assessment '!D88+'Coral Assessment '!C88+'Coral Assessment '!I86+'Coral Assessment '!H86+'Coral Assessment '!G86+'Coral Assessment '!F86+'Coral Assessment '!E86+'Coral Assessment '!D86+'Coral Assessment '!C86+'Coral Assessment '!I81+'Coral Assessment '!H81+'Coral Assessment '!G81+'Coral Assessment '!F81+'Coral Assessment '!E81+'Coral Assessment '!D81+'Coral Assessment '!C81+'Coral Assessment '!I79+'Coral Assessment '!H79+'Coral Assessment '!G79+'Coral Assessment '!F79+'Coral Assessment '!E79+'Coral Assessment '!D79+'Coral Assessment '!C79+'Coral Assessment '!E74+'Coral Assessment '!D74+'Coral Assessment '!C74+'Coral Assessment '!E73+'Coral Assessment '!D73+'Coral Assessment '!C73+'Coral Assessment '!I70+'Coral Assessment '!H70+'Coral Assessment '!G70+'Coral Assessment '!F70+'Coral Assessment '!E70+'Coral Assessment '!D70+'Coral Assessment '!C70+'Coral Assessment '!G68+'Coral Assessment '!F68+'Coral Assessment '!E68+'Coral Assessment '!D68+'Coral Assessment '!C68+'Coral Assessment '!G67)*SUM(Justifications!F66:F70)","v":0}]
{"$rows_left_out":56}
{"sheet":"Risk Assessment","index":7,"n_rows":68,"n_cols":17,"rows_kept":68,"cut":false,"hidden":true,"merged":[[67,2,67,5],[53,2,53,10],[54,2,54,9],[55,2,55,9],[56,2,56,9],[59,2,59,9],[60,2,60,9],[58,1,58,6],[61,2,61,9],[57,3,57,6],[40,5,43,5],[62,2,62,9],[38,7,38,10],[31,5,31,7],[1,3,2,8],[7,2,7,5],[33,5,33,7]]}
[]
[null,null,null,"NOTE: The following Risk Assessment Tool is intended for DAR use when evaluating an impact event relative to determining how to address the Responsible Party's actions and seek compensation, penalty, etc. It is primarily designed for Unplanned Events."]
[]
[]
[null,null,null,"Coral Impact                                     Risk Assessment",null,"Designed primarily for unplanned events.",null,null,null,null,null,null,"reg","Prop","Sever"]
[null,null,null,null,null,null,null,null,null,null,null,null,{"$f":"IF('Coral Assessment '!H4=\" \",0.5,IF('Coral Assessment '!H4=0,0.5,IF('Coral Assessment '!E189<0.5,0.5,IF('Coral Assessment '!E189<1,1,IF('Coral Assessment '!E189<2,2,IF('Coral Assessment '!E189>=2,3,0.5))))))","v":0.5},{"$f":"M6","v":0.5},null,"Spp Rich"]
[null,null,null,null,null,null,null,null,null,null,null,null,{"$f":"IF('Coral Assessment '!E191<0,'Coral Assessment '!E191*-1,'Coral Assessment '!E191)","v":0},null,{"$f":"M7","v":0},"Spp Diversity"]
[null,null,"Answer the following questions(in the yellow, pull-down menu boxes provided) regarding the activities already listed:"]
[]
[null,1,null,"What is the type of habitat affected?",null,{"$f":"'Coral Assessment '!F3","v":" "},null,null,null,null,null,null,{"$f":"'Coral Assessment '!O11","v":0},null,{"$f":"M10","v":0},"Habitat"]
{"$rows_left_out":59}
{"sheet":"RA Numbers","index":8,"n_rows":53,"n_cols":6,"rows_kept":53,"cut":false,"hidden":true,"merged":[]}
[]
[]
[]
["No",1]
["Fisheries Management Area (FMA)",2,null,null,"IF(E9=\"Fisheries Management Area (FMA), 2, IF(E9=\"Marine Life Conservation District (MLCD)\", 3, IF(E9=\"Marine Refuge, NARS, NWHI Refuge\", 4, IF(E9=\"Ocean Redreation Management Area (ORMA), 2, 1))))"]
["Marine Life Conservation District (MLCD)",3]
["Marine Refuge, NARS, NWHI Refuge",4]
["Ocean Recreation Mangement Area (ORMA)",2]
["Unknown",1]
[]
{"$rows_left_out":43}